Reaction Details
TargetCannabinoid receptor 1
LigandBDBM50353747
Substrate/Competitorn/a
Meas. Tech.ChEMBL_1481943 (CHEMBL3541169)
Ki 1.3±n/a nM
Citation Chimalakonda, KCSeely, KABratton, SMBrents, LKMoran, CLEndres, GWJames, LPHollenberg, PFPrather, PLRadominska-Pandya, AMoran, JH Cytochrome P450-mediated oxidative metabolism of abused synthetic cannabinoids found in K2/Spice: identification of novel cannabinoid receptor ligands. Drug Metab Dispos40:2174-84 (2012) 
 
Cannabinoid receptor 1
Name:Cannabinoid receptor 1
Type:Enzyme
Mol. Mass.:52842.52
Organism:Mus musculus (Mouse)
Description:P47746
Residue:473
BDBM50353747
NameBDBM50353747
Synonyms:CHEMBL561013 | JWH-018
TypeSmall organic molecule
Emp. Form.C24H23NO
Mol. Mass.341.4455
SMILESCCCCCn1cc(C(=O)c2cccc3ccccc23)c2ccccc12