Reaction Details
TargetUDP-glucuronosyltransferase 1A8
LigandBDBM50358252
Substrate/Competitorn/a
Meas. Tech.ChEMBL_1486245 (CHEMBL3534364)
Ki 354000±n/a nM
Citation Shiraga, TYajima, KSuzuki, KSuzuki, KHashimoto, TIwatsubo, TMiyashita, AUsui, T Identification of UDP-glucuronosyltransferases responsible for the glucuronidation of darexaban, an oral factor Xa inhibitor, in human liver and intestine. Drug Metab Dispos40:276-82 (2012) 
 
UDP-glucuronosyltransferase 1A8
Name:UDP-glucuronosyltransferase 1A8
Type:PROTEIN
Mol. Mass.:59751.98
Organism:Homo sapiens (Human)
Description:ChEMBL_104086
Residue:530
BDBM50358252
NameBDBM50358252
Synonyms:CHEMBL1922235
TypeSmall organic molecule
Emp. Form.C27H30N4O4
Mol. Mass.474.5515
SMILESCOc1ccc(cc1)C(=O)Nc1cccc(O)c1NC(=O)c1ccc(cc1)N1CCCN(C)CC1