Reaction Details
TargetMetabotropic glutamate receptor 5
LigandBDBM50442525
Substrate/Competitorn/a
Meas. Tech.ChEMBL_1490520 (CHEMBL3534986)
IC50 26±n/a nM
Citation Morrison, RDBlobaum, ALByers, FWSantomango, TSBridges, TMStec, DBrewer, KASanchez-Ponce, RCorlew, MMRush, RFelts, ASManka, JBates, BSVenable, DFRodriguez, ALJones, CKNiswender, CMConn, PJLindsley, CWEmmitte, KADaniels, JS The role of aldehyde oxidase and xanthine oxidase in the biotransformation of a novel negative allosteric modulator of metabotropic glutamate receptor subtype 5. Drug Metab Dispos40:1834-45 (2012) 
 
Metabotropic glutamate receptor 5
Name:Metabotropic glutamate receptor 5
Type:Enzyme
Mol. Mass.:132484.72
Organism:Homo sapiens (Human)
Description:n/a
Residue:1212
BDBM50442525
NameBDBM50442525
Synonyms:CHEMBL2440659 | US8796295, Table 2: Compound: 1
TypeSmall organic molecule
Emp. Form.C15H11FN4O2S
Mol. Mass.330.337
SMILESCc1csc(NC(=O)c2cc(F)cc(Oc3cncnc3)c2)n1