Reaction Details
TargetCytochrome P450 2B6
LigandBDBM50363928
Substrate/Competitorn/a
Meas. Tech.ChEMBL_1486257 (CHEMBL3534695)
Ki>30000±n/a nM
Citation Foti, RSPearson, JTWong, SLZalikowski, JABoudreaux, MDProkop, SPDavis, JABanfield, CEmery, MGRock, DAWahlstrom, JLWienkers, LCAmore, BM Predicting the drug interaction potential of AMG 853, a dual antagonist of the D-prostanoid and chemoattractant receptor-homologous molecule expressed on T helper 2 cells receptors. Drug Metab Dispos40:2239-49 (2012) 
 
Cytochrome P450 2B6
Name:Cytochrome P450 2B6
Type:Protein
Mol. Mass.:56289.75
Organism:Homo sapiens (Human)
Description:P20813
Residue:491
BDBM50363928
NameBDBM50363928
Synonyms:CHEMBL1951575
TypeSmall organic molecule
Emp. Form.C28H27Cl2FN2O6S
Mol. Mass.609.493
SMILESCC(C)(C)NC(=O)c1ccc(Oc2cc(F)c(CC(O)=O)cc2Cl)c(NS(=O)(=O)c2ccc(cc2Cl)C2CC2)c1