Reaction Details
TargetNuclear receptor subfamily 1 group I member 2
LigandBDBM115054
Substrate/Competitorn/a
Meas. Tech.ChEMBL_1487564 (CHEMBL3531531)
EC50 28200±n/a nM
Citation Shukla, SJSakamuru, SHuang, RMoeller, TAShinn, PVanleer, DAuld, DSAustin, CPXia, M Identification of clinically used drugs that activate pregnane X receptors. Drug Metab Dispos39:151-9 (2010) 
 
Nuclear receptor subfamily 1 group I member 2
Name:Nuclear receptor subfamily 1 group I member 2
Type:Nuclear receptor
Mol. Mass.:49774.77
Organism:Homo sapiens (Human)
Description:O75469
Residue:434
BDBM115054
NameBDBM115054
Synonyms:4-Amino-N-(2-amino-phenyl)-benzamide MLS001209873 SMR000504768 | cid_42725
TypeSmall organic molecule
Emp. Form.C13H13N3O
Mol. Mass.227.2618
SMILESNc1ccc(cc1)C(=O)Nc1ccccc1N