Reaction Details
TargetNuclear receptor subfamily 1 group I member 2
LigandBDBM50370232
Substrate/Competitorn/a
Meas. Tech.ChEMBL_1487565 (CHEMBL3531532)
EC50 3200±n/a nM
Citation Shukla, SJSakamuru, SHuang, RMoeller, TAShinn, PVanleer, DAuld, DSAustin, CPXia, M Identification of clinically used drugs that activate pregnane X receptors. Drug Metab Dispos39:151-9 (2010) 
 
Nuclear receptor subfamily 1 group I member 2
Name:Nuclear receptor subfamily 1 group I member 2
Type:Nuclear receptor
Mol. Mass.:49774.77
Organism:Homo sapiens (Human)
Description:O75469
Residue:434
BDBM50370232
NameBDBM50370232
Synonyms:BA-41166E RIFAMPIN Rifampicin
TypeSmall organic molecule
Emp. Form.C43H58N4O12
Mol. Mass.822.9402
SMILESCO[C@H]1\C=C\O[C@@]2(C)Oc3c(C2=O)c2c(O)c(\C=N\N4CCN(C)CC4)c(NC(=O)\C(C)=C/C=C/[C@H](C)[C@H](O)[C@@H](C)[C@@H](O)[C@@H](C)[C@H](OC(C)=O)[C@@H]1C)c(O)c2c(O)c3C