Reaction Details
TargetNuclear receptor subfamily 1 group I member 2
LigandBDBM50103612
Substrate/Competitorn/a
Meas. Tech.ChEMBL_1487572 (CHEMBL3531878)
EC50 15800±n/a nM
Citation Shukla, SJSakamuru, SHuang, RMoeller, TAShinn, PVanleer, DAuld, DSAustin, CPXia, M Identification of clinically used drugs that activate pregnane X receptors. Drug Metab Dispos39:151-9 (2010) 
 
Nuclear receptor subfamily 1 group I member 2
Name:Nuclear receptor subfamily 1 group I member 2
Type:Nuclear receptor
Mol. Mass.:49774.77
Organism:Homo sapiens (Human)
Description:O75469
Residue:434
BDBM50103612
NameBDBM50103612
Synonyms:CHEMBL2356116
TypeSmall organic molecule
Emp. Form.C41H49ClN2O9
Mol. Mass.749.289
SMILESCl.COc1ccc(CCN(CCc2ccc(OC)c(OC)c2OC)C(=O)C(C2=NCCc3cc(OC)c(OC)cc23)c2ccccc2)c(OC)c1OC