Reaction Details
TargetNuclear receptor subfamily 1 group I member 2
LigandBDBM50103606
Substrate/Competitorn/a
Meas. Tech.ChEMBL_1487563 (CHEMBL3531530)
EC50 400±n/a nM
Citation Shukla, SJSakamuru, SHuang, RMoeller, TAShinn, PVanleer, DAuld, DSAustin, CPXia, M Identification of clinically used drugs that activate pregnane X receptors. Drug Metab Dispos39:151-9 (2010) 
 
Nuclear receptor subfamily 1 group I member 2
Name:Nuclear receptor subfamily 1 group I member 2
Type:Nuclear receptor
Mol. Mass.:49774.77
Organism:Homo sapiens (Human)
Description:O75469
Residue:434
BDBM50103606
NameBDBM50103606
Synonyms:ORG-6216 Vexol
TypeSmall organic molecule
Emp. Form.C24H34O3
Mol. Mass.370.525
SMILES[H][C@@]12C[C@@H](C)[C@](C)(C(=O)CC)[C@@]1(C)C[C@H](O)[C@@]1([H])[C@@]2([H])CCC2=CC(=O)C=C[C@]12C