Reaction Details
TargetNuclear receptor subfamily 1 group I member 2
LigandBDBM50103619
Substrate/Competitorn/a
Meas. Tech.ChEMBL_1487572 (CHEMBL3531878)
EC50 7900±n/a nM
Citation Shukla, SJSakamuru, SHuang, RMoeller, TAShinn, PVanleer, DAuld, DSAustin, CPXia, M Identification of clinically used drugs that activate pregnane X receptors. Drug Metab Dispos39:151-9 (2010) 
 
Nuclear receptor subfamily 1 group I member 2
Name:Nuclear receptor subfamily 1 group I member 2
Type:Nuclear receptor
Mol. Mass.:49774.77
Organism:Homo sapiens (Human)
Description:O75469
Residue:434
BDBM50103619
NameBDBM50103619
Synonyms:CHEMBL1411951
TypeSmall organic molecule
Emp. Form.C12H14Cl3O4P
Mol. Mass.359.57
SMILESCCOP(=O)(OCC)O\C(=C\Cl)c1ccc(Cl)cc1Cl