Reaction Details
TargetNuclear receptor subfamily 1 group I member 2
LigandBDBM50101963
Substrate/Competitorn/a
Meas. Tech.ChEMBL_1487564 (CHEMBL3531531)
EC50 10000±n/a nM
Citation Shukla, SJSakamuru, SHuang, RMoeller, TAShinn, PVanleer, DAuld, DSAustin, CPXia, M Identification of clinically used drugs that activate pregnane X receptors. Drug Metab Dispos39:151-9 (2010) 
 
Nuclear receptor subfamily 1 group I member 2
Name:Nuclear receptor subfamily 1 group I member 2
Type:Nuclear receptor
Mol. Mass.:49774.77
Organism:Homo sapiens (Human)
Description:O75469
Residue:434
BDBM50101963
NameBDBM50101963
Synonyms:BAY-K-5552 Nisoldipine | Sular
TypeSmall organic molecule
Emp. Form.C20H24N2O6
Mol. Mass.388.4144
SMILESCOC(=O)C1=C(C)NC(C)=C(C1c1ccccc1[N+]([O-])=O)C(=O)OCC(C)C