Reaction Details
TargetNuclear receptor subfamily 1 group I member 2
LigandBDBM189379
Substrate/Competitorn/a
Meas. Tech.ChEMBL_1487572 (CHEMBL3531878)
EC50 7100±n/a nM
Citation Shukla, SJSakamuru, SHuang, RMoeller, TAShinn, PVanleer, DAuld, DSAustin, CPXia, M Identification of clinically used drugs that activate pregnane X receptors. Drug Metab Dispos39:151-9 (2010) 
 
Nuclear receptor subfamily 1 group I member 2
Name:Nuclear receptor subfamily 1 group I member 2
Type:Nuclear receptor
Mol. Mass.:49774.77
Organism:Homo sapiens (Human)
Description:O75469
Residue:434
BDBM189379
NameBDBM189379
Synonyms:5-O-ethyl 3-O-methyl 4-(2,3-dichlorophenyl)-2,6-dimethyl-1,4-dihydropyridine-3,5-dicarboxylate | Felodipine
TypeSmall organic molecule
Emp. Form.C18H19Cl2NO4
Mol. Mass.384.254
SMILESCCOC(=O)C1=C(C)NC(C)=C(C1c1cccc(Cl)c1Cl)C(=O)OC