Reaction Details
TargetNuclear receptor subfamily 1 group I member 2
LigandBDBM50103607
Substrate/Competitorn/a
Meas. Tech.ChEMBL_1487572 (CHEMBL3531878)
EC50 14100±n/a nM
Citation Shukla, SJSakamuru, SHuang, RMoeller, TAShinn, PVanleer, DAuld, DSAustin, CPXia, M Identification of clinically used drugs that activate pregnane X receptors. Drug Metab Dispos39:151-9 (2010) 
 
Nuclear receptor subfamily 1 group I member 2
Name:Nuclear receptor subfamily 1 group I member 2
Type:Nuclear receptor
Mol. Mass.:49774.77
Organism:Homo sapiens (Human)
Description:O75469
Residue:434
BDBM50103607
NameBDBM50103607
Synonyms:Surital | Thiamylal Sodium
TypeSmall organic molecule
Emp. Form.C12H17N2NaO2S
Mol. Mass.276.33
SMILES[Na+].CCCC(C)C1(CC=C)C(=O)NC([S-])=NC1=O