Reaction Details
TargetNuclear receptor subfamily 1 group I member 2
LigandBDBM50103625
Substrate/Competitorn/a
Meas. Tech.ChEMBL_1487572 (CHEMBL3531878)
EC50 12600±n/a nM
Citation Shukla, SJSakamuru, SHuang, RMoeller, TAShinn, PVanleer, DAuld, DSAustin, CPXia, M Identification of clinically used drugs that activate pregnane X receptors. Drug Metab Dispos39:151-9 (2010) 
 
Nuclear receptor subfamily 1 group I member 2
Name:Nuclear receptor subfamily 1 group I member 2
Type:Nuclear receptor
Mol. Mass.:49774.77
Organism:Homo sapiens (Human)
Description:O75469
Residue:434
BDBM50103625
NameBDBM50103625
Synonyms:CHEMBL1318553
TypeSmall organic molecule
Emp. Form.C19H22N2O
Mol. Mass.294.3908
SMILES[H][C@@]12N3CCC[C@]1(CC)CC(=O)n1c2c(CC3)c2ccccc12