Reaction Details
TargetNuclear receptor subfamily 1 group I member 2
LigandBDBM50103624
Substrate/Competitorn/a
Meas. Tech.ChEMBL_1487572 (CHEMBL3531878)
EC50 3200±n/a nM
Citation Shukla, SJSakamuru, SHuang, RMoeller, TAShinn, PVanleer, DAuld, DSAustin, CPXia, M Identification of clinically used drugs that activate pregnane X receptors. Drug Metab Dispos39:151-9 (2010) 
 
Nuclear receptor subfamily 1 group I member 2
Name:Nuclear receptor subfamily 1 group I member 2
Type:Nuclear receptor
Mol. Mass.:49774.77
Organism:Homo sapiens (Human)
Description:O75469
Residue:434
BDBM50103624
NameBDBM50103624
Synonyms:40602 Cefaloridine Kefloridin | Loridine
TypeSmall organic molecule
Emp. Form.C19H17N3O4S2
Mol. Mass.415.486
SMILES[H][C@]12SCC(C[n+]3ccccc3)=C(N1C(=O)[C@H]2NC(=O)Cc1cccs1)C([O-])=O