Reaction Details
TargetNuclear receptor subfamily 1 group I member 2
LigandBDBM50103763
Substrate/Competitorn/a
Meas. Tech.ChEMBL_1487572 (CHEMBL3531878)
EC50 12600±n/a nM
Citation Shukla, SJSakamuru, SHuang, RMoeller, TAShinn, PVanleer, DAuld, DSAustin, CPXia, M Identification of clinically used drugs that activate pregnane X receptors. Drug Metab Dispos39:151-9 (2010) 
 
Nuclear receptor subfamily 1 group I member 2
Name:Nuclear receptor subfamily 1 group I member 2
Type:Nuclear receptor
Mol. Mass.:49774.77
Organism:Homo sapiens (Human)
Description:O75469
Residue:434
BDBM50103763
NameBDBM50103763
Synonyms:CHEBI:11684 Reverse Tri-Iodothyronine
TypeSmall organic molecule
Emp. Form.C15H12I3NO4
Mol. Mass.650.9735
SMILESN[C@@H](Cc1ccc(Oc2cc(I)c(O)c(I)c2)c(I)c1)C(O)=O