Reaction Details
TargetNuclear receptor subfamily 1 group I member 2
LigandBDBM50103630
Substrate/Competitorn/a
Meas. Tech.ChEMBL_1487572 (CHEMBL3531878)
EC50 14100±n/a nM
Citation Shukla, SJSakamuru, SHuang, RMoeller, TAShinn, PVanleer, DAuld, DSAustin, CPXia, M Identification of clinically used drugs that activate pregnane X receptors. Drug Metab Dispos39:151-9 (2010) 
 
Nuclear receptor subfamily 1 group I member 2
Name:Nuclear receptor subfamily 1 group I member 2
Type:Nuclear receptor
Mol. Mass.:49774.77
Organism:Homo sapiens (Human)
Description:O75469
Residue:434
BDBM50103630
NameBDBM50103630
Synonyms:Riodipine
TypeSmall organic molecule
Emp. Form.C18H19F2NO5
Mol. Mass.367.344
SMILESCOC(=O)C1=C(C)NC(C)=C(C1c1ccccc1OC(F)F)C(=O)OC