Reaction Details
TargetFibroblast growth factor receptor 1
LigandBDBM50088495
Substrate/Competitorn/a
Meas. Tech.ChEMBL_1483698 (CHEMBL3538197)
IC50 26±n/a nM
Citation Gong, JGan, JCaceres-Cortes, JChristopher, LJArora, VMasson, EWilliams, DPursley, JAllentoff, ALago, MTran, SBIyer, RA Metabolism and disposition of [14C]brivanib alaninate after oral administration to rats, monkeys, and humans. Drug Metab Dispos39:891-903 (2011) 
 
Fibroblast growth factor receptor 1
Name:Fibroblast growth factor receptor 1
Type:Receptor
Mol. Mass.:91861.70
Organism:Homo sapiens (Human)
Description:P11362
Residue:822
BDBM50088495
NameBDBM50088495
Synonyms:CHEMBL3527569
TypeSmall organic molecule
Emp. Form.C19H19FN4O6S
Mol. Mass.450.441
SMILESC[C@H](COc1cn2ncnc(Oc3ccc4[nH]c(C)cc4c3F)c2c1C)OS(O)(=O)=O