Reaction Details
TargetFibroblast growth factor receptor 1
LigandBDBM50184807
Substrate/Competitorn/a
Meas. Tech.ChEMBL_1483698 (CHEMBL3538197)
IC50 28±n/a nM
Citation Gong, JGan, JCaceres-Cortes, JChristopher, LJArora, VMasson, EWilliams, DPursley, JAllentoff, ALago, MTran, SBIyer, RA Metabolism and disposition of [14C]brivanib alaninate after oral administration to rats, monkeys, and humans. Drug Metab Dispos39:891-903 (2011) 
 
Fibroblast growth factor receptor 1
Name:Fibroblast growth factor receptor 1
Type:Receptor
Mol. Mass.:91861.70
Organism:Homo sapiens (Human)
Description:P11362
Residue:822
BDBM50184807
NameBDBM50184807
Synonyms:(R)-1-(4-(4-fluoro-2-methyl-1H-indol-5-yloxy)-5-methylpyrrolo[1,2-f][1,2,4]triazin-6-yloxy)propan-2-ol BMS-540215 | CHEMBL377300
TypeSmall organic molecule
Emp. Form.C19H19FN4O3
Mol. Mass.370.3776
SMILESC[C@@H](O)COc1cn2ncnc(Oc3ccc4[nH]c(C)cc4c3F)c2c1C