Reaction Details
TargetUDP-glucuronosyltransferase 1A1
LigandBDBM50044561
Substrate/Competitorn/a
Meas. Tech.ChEMBL_1493885 (CHEMBL3528266)
Ki 4670±n/a nM
Citation Uchihashi, SFukumoto, HOnoda, MHayakawa, HIkushiro, SSakaki, T Metabolism of the c-Fos/activator protein-1 inhibitor T-5224 by multiple human UDP-glucuronosyltransferase isoforms. Drug Metab Dispos39:803-13 (2011) 
 
UDP-glucuronosyltransferase 1A1
Name:UDP-glucuronosyltransferase 1A1
Type:Enzyme
Mol. Mass.:59604.34
Organism:Homo sapiens (Human)
Description:P22309
Residue:533
BDBM50044561
NameBDBM50044561
Synonyms:CHEMBL3222137
TypeSmall organic molecule
Emp. Form.C29H27NO8
Mol. Mass.517.5266
SMILESOC(=O)CCc1cc(ccc1OCc1ccc2c(O)noc2c1)C(=O)c1ccc(OC2CCCC2)cc1O