Reaction Details
TargetCytochrome P450 2C8
LigandBDBM11543
Substrate/Competitorn/a
Meas. Tech.ChEMBL_1492474 (CHEMBL3528849)
IC50>200000±n/a nM
Citation Su, HBoulton, DWBarros, AWang, LCao, KBonacorsi, SJIyer, RAHumphreys, WGChristopher, LJ Characterization of the in vitro and in vivo metabolism and disposition and cytochrome P450 inhibition/induction profile of saxagliptin in human. Drug Metab Dispos40:1345-56 (2012) 
 
Cytochrome P450 2C8
Name:Cytochrome P450 2C8
Type:Protein
Mol. Mass.:55839.23
Organism:Homo sapiens (Human)
Description:P10632
Residue:490
BDBM11543
NameBDBM11543
Synonyms:(1S,3S,5S)-2-[(2S)-2-amino-2-(3,5-dihydroxyadamantan-1-yl)acetyl]-2-azabicyclo[3.1.0]hexane-3-carbonitrile; 2,2,2-trifluoroacetic acid BMS-477118 | Saxagliptin analogue 28
TypeSmall organic molecule
Emp. Form.C18H25N3O3
Mol. Mass.331.4094
SMILESN[C@H](C(=O)N1[C@H]2C[C@H]2C[C@H]1C#N)C12CC3CC(O)(CC(O)(C3)C1)C2