Reaction Details
TargetUDP-glucuronosyltransferase 1A10
LigandBDBM50088505
Substrate/Competitorn/a
Meas. Tech.ChEMBL_1491709 (CHEMBL3536901)
Ki 242000±n/a nM
Citation Gao, CZhang, HGuo, ZYou, TChen, XZhong, D Mechanistic studies on the absorption and disposition of scutellarin in humans: selective OATP2B1-mediated hepatic uptake is a likely key determinant for its unique pharmacokinetic characteristics. Drug Metab Dispos40:2009-20 (2012) 
 
UDP-glucuronosyltransferase 1A10
Name:UDP-glucuronosyltransferase 1A10
Type:PROTEIN
Mol. Mass.:59817.97
Organism:Homo sapiens (Human)
Description:ChEMBL_1491709
Residue:530
BDBM50088505
NameBDBM50088505
Synonyms:CHEMBL3542370
TypeSmall organic molecule
Emp. Form.C21H18O12
Mol. Mass.462.3604
SMILESO[C@H]1[C@H](Oc2c(O)cc3oc(cc(=O)c3c2O)-c2ccc(O)cc2)O[C@@H]([C@@H](O)[C@@H]1O)C(O)=O