Reaction Details
TargetCytochrome P450 2C8
LigandBDBM58922
Substrate/Competitorn/a
Meas. Tech.ChEMBL_1486371 (CHEMBL3536199)
Ki 11000±n/a nM
Citation Filppula, AMLaitila, JNeuvonen, PJBackman, JT Reevaluation of the microsomal metabolism of montelukast: major contribution by CYP2C8 at clinically relevant concentrations. Drug Metab Dispos39:904-11 (2011) 
 
Cytochrome P450 2C8
Name:Cytochrome P450 2C8
Type:Protein
Mol. Mass.:55839.23
Organism:Homo sapiens (Human)
Description:P10632
Residue:490
BDBM58922
NameBDBM58922
Synonyms:MLS001304727 SMR000469188 sodium;2-[1-[[(1R)-1-[3-[(E)-2-(7-chloranylquinolin-2-yl)ethenyl]phenyl]-3-[2-(2-oxidanylpropan-2-yl)phenyl]propyl]sulfanylmethyl]cyclopropyl]ethanoate sodium;2-[1-[[[(1R)-1-[3-[(E)-2-(7-chloro-2-quinolinyl)ethenyl]phenyl]-3-[2-(2-hydroxypropan-2-yl)phenyl]propyl]thio]methyl]cyclopropyl]acetate | sodium;2-[1-[[[(1R)-1-[3-[(E)-2-(7-chloro-2-quinolyl)vinyl]phenyl]-3-[2-(1-hydroxy-1-methyl-ethyl)phenyl]propyl]thio]methyl]cyclopropyl]acetate
TypeSmall organic molecule
Emp. Form.C35H35ClNO3S
Mol. Mass.585.176
SMILESCC(C)(O)c1ccccc1CC[C@@H](SCC1(CC([O-])=O)CC1)c1cccc(\C=C\c2ccc3ccc(Cl)cc3n2)c1