Reaction Details
TargetSulfotransferase 1A1
LigandBDBM17292
Substrate/Competitorn/a
Meas. Tech.ChEMBL_1484210 (CHEMBL3537871)
Kd 2300±n/a nM
Citation Rohn, KJCook, ITLeyh, TSKadlubar, SAFalany, CN Potent inhibition of human sulfotransferase 1A1 by 17a-ethinylestradiol: role of 3'-phosphoadenosine 5'-phosphosulfate binding and structural rearrangements in regulating inhibition and activity. Drug Metab Dispos40:1588-95 (2012) 
 
Sulfotransferase 1A1
Name:Sulfotransferase 1A1
Type:Enzyme
Mol. Mass.:34165.45
Organism:Homo sapiens (Human)
Description:P50225
Residue:295
BDBM17292
NameBDBM17292
Synonyms:(1S,10R,11S,14S,15S)-15-methyltetracyclo[8.7.0.0^{2,7}.0^{11,15}]heptadeca-2,4,6-triene-5,14-diol 17α-ethinylestradiol CHEMBL135 ESTRADIOL Ovocyclin US9040509, E2 US9561238, E2 [2,4,6,7-3H]-E2 [3H]]estradiol
TypeSteroid
Emp. Form.C18H24O2
Mol. Mass.272.382
SMILES[H][C@@]12CC[C@H](O)[C@@]1(C)CC[C@]1([H])c3ccc(O)cc3CC[C@@]21[H]