Reaction Details
TargetUDP-glucuronosyltransferase 1A1
LigandBDBM50187243
Substrate/Competitorn/a
Meas. Tech.ChEMBL_1486476 (CHEMBL3531466)
IC50 44000±n/a nM
Citation Zhou, JTracy, TSRemmel, RP Correlation between bilirubin glucuronidation and estradiol-3-gluronidation in the presence of model UDP-glucuronosyltransferase 1A1 substrates/inhibitors. Drug Metab Dispos39:322-9 (2011) 
 
UDP-glucuronosyltransferase 1A1
Name:UDP-glucuronosyltransferase 1A1
Type:Enzyme
Mol. Mass.:59604.34
Organism:Homo sapiens (Human)
Description:P22309
Residue:533
BDBM50187243
NameBDBM50187243
Synonyms:17-ethinyl-3,17-estradiol 17-ethinylestradiol 17alpha-ethynylestra-1,3,5(10)-triene-3,17beta-diol CHEMBL691 Ethinylestradiol ethinyloestradiol
TypeSmall organic molecule
Emp. Form.C20H24O2
Mol. Mass.296.4034
SMILESC[C@]12CC[C@H]3[C@@H](CCc4cc(O)ccc34)[C@@H]1CC[C@@]2(O)C#C