Reaction Details
TargetUDP-glucuronosyltransferase 1A1
LigandBDBM85507
Substrate/Competitorn/a
Meas. Tech.ChEMBL_1486476 (CHEMBL3531466)
IC50 13000±n/a nM
Citation Zhou, JTracy, TSRemmel, RP Correlation between bilirubin glucuronidation and estradiol-3-gluronidation in the presence of model UDP-glucuronosyltransferase 1A1 substrates/inhibitors. Drug Metab Dispos39:322-9 (2011) 
 
UDP-glucuronosyltransferase 1A1
Name:UDP-glucuronosyltransferase 1A1
Type:Enzyme
Mol. Mass.:59604.34
Organism:Homo sapiens (Human)
Description:P22309
Residue:533
BDBM85507
NameBDBM85507
Synonyms:CAS_4394-00-7 Niflumic acid US10278929, Niflumic acid US20240002326, Compound Niflumic acid
TypeSmall organic molecule
Emp. Form.C13H9F3N2O2
Mol. Mass.282.218
SMILESOC(=O)c1cccnc1Nc1cccc(c1)C(F)(F)F