Reaction Details
TargetUDP-glucuronosyltransferase 1A1
LigandBDBM50101979
Substrate/Competitorn/a
Meas. Tech.ChEMBL_1486476 (CHEMBL3531466)
IC50 4000±n/a nM
Citation Zhou, JTracy, TSRemmel, RP Correlation between bilirubin glucuronidation and estradiol-3-gluronidation in the presence of model UDP-glucuronosyltransferase 1A1 substrates/inhibitors. Drug Metab Dispos39:322-9 (2011) 
 
UDP-glucuronosyltransferase 1A1
Name:UDP-glucuronosyltransferase 1A1
Type:Enzyme
Mol. Mass.:59604.34
Organism:Homo sapiens (Human)
Description:P22309
Residue:533
BDBM50101979
NameBDBM50101979
Synonyms:2,6-Dihydroxyanthraquinone 2,6-dihydroxy-9,10-anthraquinone 2,6-dihydroxyanthracene-9,10-dione CHEMBL298398 anthraflavin
TypeSmall organic molecule
Emp. Form.C14H8O4
Mol. Mass.240.2109
SMILESOc1ccc2C(=O)c3cc(O)ccc3C(=O)c2c1