Reaction Details
TargetUDP-glucuronosyltransferase 1A1
LigandBDBM50301375
Substrate/Competitorn/a
Meas. Tech.ChEMBL_1486475 (CHEMBL3531465)
IC50 4900±n/a nM
Citation Zhou, JTracy, TSRemmel, RP Correlation between bilirubin glucuronidation and estradiol-3-gluronidation in the presence of model UDP-glucuronosyltransferase 1A1 substrates/inhibitors. Drug Metab Dispos39:322-9 (2011) 
 
UDP-glucuronosyltransferase 1A1
Name:UDP-glucuronosyltransferase 1A1
Type:Enzyme
Mol. Mass.:59604.34
Organism:Homo sapiens (Human)
Description:P22309
Residue:533
BDBM50301375
NameBDBM50301375
Synonyms:3,3',5,5'-tetraiodo-L-thyronine 4-(4-hydroxy-3,5-diiodophenoxy)-3,5-diiodo-L-phenylalanine L-T4 O-(4-hydroxy-3,5-diiodophenyl)-3,5-diiodo-L-tyrosine | levothyroxine
TypeSmall organic molecule
Emp. Form.C15H11I4NO4
Mol. Mass.776.87
SMILESN[C@@H](Cc1cc(I)c(Oc2cc(I)c(O)c(I)c2)c(I)c1)C(O)=O