Reaction Details
TargetLiver carboxylesterase 1
LigandBDBM50088513
Substrate/Competitorn/a
Meas. Tech.ChEMBL_1494238 (CHEMBL3530686)
Ki 24800±n/a nM
Citation Inoue, NRHall, ALai, WGWilliams, ET Reversible inhibition of human carboxylesterases by acyl glucuronides. Drug Metab Dispos41:698-703 (2013) 
 
Liver carboxylesterase 1
Name:Liver carboxylesterase 1
Type:Protein
Mol. Mass.:62520.83
Organism:Homo sapiens (Human)
Description:n/a
Residue:567
BDBM50088513
NameBDBM50088513
Synonyms:CHEMBL3526940
TypeSmall organic molecule
Emp. Form.C21H22ClNO8S
Mol. Mass.483.919
SMILESO[C@H]1[C@H](OC(=O)[C@@H](N2CCc3sccc3C2)c2ccccc2Cl)O[C@@H]([C@@H](O)[C@@H]1O)C(O)=O