Reaction Details
TargetSodium/nucleoside cotransporter 2
LigandBDBM50138530
Substrate/Competitorn/a
Meas. Tech.ChEMBL_1494516 (CHEMBL3528993)
IC50 239000±n/a nM
Citation Lepist, EIDamaraju, VLZhang, JGati, WPYao, SYSmith, KMKarpinski, EYoung, JDLeung, KHCass, CE Transport of A1 adenosine receptor agonist tecadenoson by human and mouse nucleoside transporters: evidence for blood-brain barrier transport by murine equilibrative nucleoside transporter 1 mENT1. Drug Metab Dispos41:916-22 (2013) 
 
Sodium/nucleoside cotransporter 2
Name:Sodium/nucleoside cotransporter 2
Type:PROTEIN
Mol. Mass.:71934.06
Organism:Homo sapiens (Human)
Description:ChEMBL_1477251
Residue:658
BDBM50138530
NameBDBM50138530
Synonyms:(2R,3R,5R)-2-Hydroxymethyl-5-{6-[(R)-(tetrahydro-furan-3-yl)amino]-purin-9-yl}-tetrahydro-furan-3,4-diol BDBM50224766 CVT-510 | Tecadenoson
TypeSmall organic molecule
Emp. Form.C14H19N5O5
Mol. Mass.337.3312
SMILESOC[C@H]1O[C@H]([C@H](O)[C@@H]1O)n1cnc2c(N[C@@H]3CCOC3)ncnc12