Reaction Details
TargetKynurenine 3-monooxygenase
LigandBDBM50088519
Substrate/Competitorn/a
Meas. Tech.ChEMBL_1487468 (CHEMBL3536663)
IC50 10000±n/a nM
Citation Beconi, MGYates, DLyons, KMatthews, KClifton, SMead, TPrime, MWinkler, DO'Connell, CWalter, DToledo-Sherman, LMunoz-Sanjuan, IDominguez, C Metabolism and pharmacokinetics of JM6 in mice: JM6 is not a prodrug for Ro-61-8048. Drug Metab Dispos40:2297-306 (2012) 
 
Kynurenine 3-monooxygenase
Name:Kynurenine 3-monooxygenase
Type:PROTEIN
Mol. Mass.:54371.88
Organism:Rattus norvegicus
Description:ChEMBL_1487468
Residue:478
BDBM50088519
NameBDBM50088519
Synonyms:CHEMBL3526743
TypeSmall organic molecule
Emp. Form.C18H18N4O6S2
Mol. Mass.450.489
SMILESCOc1ccc(cc1OC)S(=O)(=O)Nc1nc(c(CN)s1)-c1cccc(c1)[N+]([O-])=O