Reaction Details
TargetMicrotubule-associated protein 2
LigandBDBM50088522
Substrate/Competitorn/a
Meas. Tech.ChEMBL_1492831 (CHEMBL3527961)
EC50 8.8±n/a nM
Citation Arico-Muendel, CCBelanger, BBenjamin, DBlanchette, HSCaiazzo, TMCentrella, PADeLorey, JDoyle, EGGradhand, UGriffin, STHill, SLabenski, MTMorgan, BAO'Donovan, GPrasad, KSkinner, STaghizadeh, NThompson, CDWakefield, JWestlin, WWhite, KF Metabolites of PPI-2458, a selective, irreversible inhibitor of methionine aminopeptidase-2: structure determination and in vivo activity. Drug Metab Dispos41:814-26 (2013) 
 
Microtubule-associated protein 2
Name:Microtubule-associated protein 2
Type:PROTEIN
Mol. Mass.:199423.64
Organism:Homo sapiens (Human)
Description:ChEMBL_107603
Residue:1827
BDBM50088522
NameBDBM50088522
Synonyms:CHEMBL3527218
TypeSmall organic molecule
Emp. Form.C22H36N2O8
Mol. Mass.456.5298
SMILES[H][C@]1(C[C@H]2O[C@]2(C)[C@@]2([H])[C@H](OC)[C@@H](CC[C@]22CO2)OC(=O)N[C@@H](C(N)=O)C(C)(C)O)OC1(C)C