Reaction Details
TargetPotassium voltage-gated channel subfamily B member 1
LigandBDBM50088572
Substrate/Competitorn/a
Meas. Tech.ChEMBL_1496410 (CHEMBL3580176)
IC50 1000±n/a nM
Citation Kim, HYang, IRyu, SYWon, DHGiri, AGWang, WChoi, HChin, JHahn, DKim, EHan, CLee, JNam, SJHo, WKKang, H Acredinones A and B, voltage-dependent potassium channel inhibitors from the sponge-derived fungus Acremonium sp. F9A015. J Nat Prod78:363-7 (2015) 
 
Potassium voltage-gated channel subfamily B member 1
Name:Potassium voltage-gated channel subfamily B member 1
Type:Protein
Mol. Mass.:95890.66
Organism:Homo sapiens (Human)
Description:Q14721
Residue:858
BDBM50088572
NameBDBM50088572
Synonyms:CHEMBL3577209
TypeSmall organic molecule
Emp. Form.C36H36O11
Mol. Mass.644.6644
SMILESCOc1cccc(OC)c1C(=O)c1c(O)cc(C)c(OC)c1CC(=O)c1c(OC)c(C)cc(O)c1C(=O)c1c(OC)cccc1OC