Reaction Details
TargetPotassium voltage-gated channel subfamily B member 1
LigandBDBM50088573
Substrate/Competitorn/a
Meas. Tech.ChEMBL_1496410 (CHEMBL3580176)
IC50 590±n/a nM
Citation Kim, HYang, IRyu, SYWon, DHGiri, AGWang, WChoi, HChin, JHahn, DKim, EHan, CLee, JNam, SJHo, WKKang, H Acredinones A and B, voltage-dependent potassium channel inhibitors from the sponge-derived fungus Acremonium sp. F9A015. J Nat Prod78:363-7 (2015) 
 
Potassium voltage-gated channel subfamily B member 1
Name:Potassium voltage-gated channel subfamily B member 1
Type:Protein
Mol. Mass.:95890.66
Organism:Homo sapiens (Human)
Description:Q14721
Residue:858
BDBM50088573
NameBDBM50088573
Synonyms:CHEMBL3577208
TypeSmall organic molecule
Emp. Form.C36H34O10
Mol. Mass.626.6492
SMILESCOc1cccc(OC)c1C(=O)c1c(O)cc(C)c(OC)c1C1=C(c2c(C1=O)c(OC)c(C)cc2O)c1c(OC)cccc1OC