Reaction Details
TargetATP-dependent translocase ABCB1
LigandBDBM50088576
Substrate/Competitorn/a
Meas. Tech.ChEMBL_1496424 (CHEMBL3580314)
Ki 420±n/a nM
Citation Callies, OSánchez-Cañete, MPGamarro, FJiménez, IACastanys, SBazzocchi, IL Restoration of Chemosensitivity in P-Glycoprotein-Dependent Multidrug-Resistant Cells by Dihydro-ß-agarofuran Sesquiterpenes from Celastrus vulcanicola. J Nat Prod78:736-45 (2015) 
 
ATP-dependent translocase ABCB1
Name:ATP-dependent translocase ABCB1
Type:Protein
Mol. Mass.:141503.50
Organism:Homo sapiens (Human)
Description:P08183
Residue:1280
BDBM50088576
NameBDBM50088576
Synonyms:CHEMBL3577215
TypeSmall organic molecule
Emp. Form.C35H40O11
Mol. Mass.636.6855
SMILES[H][C@@]12[C@@H](O)[C@]3(OC1(C)C)[C@@](C)(O)C[C@H](OC(C)=O)[C@H](OC(C)=O)[C@@]3(C)[C@@H](OC(=O)c1ccccc1)[C@H]2OC(=O)\C=C\c1ccccc1