Reaction Details
TargetD(2) dopamine receptor
LigandBDBM50088578
Substrate/Competitorn/a
Meas. Tech.ChEMBL_1496588 (CHEMBL3578854)
Ki 1.6±n/a nM
Citation Weichert, DBanerjee, AHiller, CKling, RCHübner, HGmeiner, P Molecular determinants of biased agonism at the dopamine D2 receptor. J Med Chem58:2703-17 (2015) 
 
D(2) dopamine receptor
Name:D(2) dopamine receptor
Type:Cell-surface receptors
Mol. Mass.:50647.10
Organism:Homo sapiens (Human)
Description:P14416
Residue:443
BDBM50088578
NameBDBM50088578
Synonyms:CHEMBL3577342
TypeSmall organic molecule
Emp. Form.C31H45N5O4
Mol. Mass.551.7201
SMILESCCCCn1cc(CCCOc2ccc(cc2OC)C(=O)NCCCCN(CCC)[C@H]2COC(=CC2)C#C)nn1