Reaction Details
TargetAcetylcholinesterase
LigandBDBM10620
Substrate/Competitorn/a
Meas. Tech.ChEMBL_1496997 (CHEMBL3579631)
IC50 21000±n/a nM
Citation Sang, ZQiang, XLi, YYuan, WLiu, QShi, YAng, WLuo, YTan, ZDeng, Y Design, synthesis and evaluation of scutellarein-O-alkylamines as multifunctional agents for the treatment of Alzheimer's disease. Eur J Med Chem94:348-66 (2015) 
 
Acetylcholinesterase
Name:Acetylcholinesterase
Type:Enzyme
Mol. Mass.:68193.62
Organism:Rattus norvegicus (rat)
Description:P37136
Residue:614
BDBM10620
NameBDBM10620
Synonyms:(S)-3-(1-(dimethylamino)ethyl)phenyl ethyl(methyl)carbamate 3-(1-(dimethylamino)ethyl)phenyl ethyl(methyl)carbamate CHEMBL636 Ethyl-methyl-carbamic acid 3-((R)-1-dimethylamino-ethyl)-phenyl ester Ethyl-methyl-carbamic acid 3-(1-dimethylamino-ethyl)-phenyl ester Rivastigmine SDZ-212-713 | SDZ-ENA-713
TypeSmall organic molecule
Emp. Form.C14H22N2O2
Mol. Mass.250.3367
SMILES[H][C@@](C)(N(C)C)c1cccc(OC(=O)N(C)CC)c1