Reaction Details
TargetMitogen-activated protein kinase 14
LigandBDBM50089083
Substrate/Competitorn/a
Meas. Tech.ChEMBL_1497088 (CHEMBL3580221)
IC50 4.6±n/a nM
Citation Awadallah, FMAbou-Seri, SMAbdulla, MMGeorgey, HH Design and synthesis of potent 1,2,4-trisubstituted imidazolinone derivatives with dual p38aMAPK and ERK1/2 inhibitory activity. Eur J Med Chem94:397-404 (2015) 
 
Mitogen-activated protein kinase 14
Name:Mitogen-activated protein kinase 14
Type:Serine/threonine-protein kinase
Mol. Mass.:41286.76
Organism:Homo sapiens (Human)
Description:Q16539
Residue:360
BDBM50089083
NameBDBM50089083
Synonyms:CHEMBL3577635
TypeSmall organic molecule
Emp. Form.C31H24ClN3O4
Mol. Mass.537.993
SMILESCOc1cccc(c1)N1C(=O)\C(=C\c2ccc(OCC(=O)Nc3ccc(Cl)cc3)cc2)N=C1c1ccccc1