Reaction Details
TargetMitogen-activated protein kinase 14
LigandBDBM50088858
Substrate/Competitorn/a
Meas. Tech.ChEMBL_1497088 (CHEMBL3580221)
IC50 4.5±n/a nM
Citation Awadallah, FMAbou-Seri, SMAbdulla, MMGeorgey, HH Design and synthesis of potent 1,2,4-trisubstituted imidazolinone derivatives with dual p38aMAPK and ERK1/2 inhibitory activity. Eur J Med Chem94:397-404 (2015) 
 
Mitogen-activated protein kinase 14
Name:Mitogen-activated protein kinase 14
Type:Serine/threonine-protein kinase
Mol. Mass.:41286.76
Organism:Homo sapiens (Human)
Description:Q16539
Residue:360
BDBM50088858
NameBDBM50088858
Synonyms:CHEMBL3577566
TypeSmall organic molecule
Emp. Form.C32H27N3O4
Mol. Mass.517.5745
SMILESCOc1cccc(c1)N1C(=O)\C(=C\c2ccc(OCC(=O)Nc3ccc(C)cc3)cc2)N=C1c1ccccc1