Reaction Details
TargetMitogen-activated protein kinase 1
LigandBDBM50088895
Substrate/Competitorn/a
Meas. Tech.ChEMBL_1497090 (CHEMBL3580223)
IC50 54±n/a nM
Citation Awadallah, FMAbou-Seri, SMAbdulla, MMGeorgey, HH Design and synthesis of potent 1,2,4-trisubstituted imidazolinone derivatives with dual p38aMAPK and ERK1/2 inhibitory activity. Eur J Med Chem94:397-404 (2015) 
 
Mitogen-activated protein kinase 1
Name:Mitogen-activated protein kinase 1
Type:Ser/Thr Protein Kinase
Mol. Mass.:41392.76
Organism:Homo sapiens (Human)
Description:P28482
Residue:360
BDBM50088895
NameBDBM50088895
Synonyms:CHEMBL3577563
TypeSmall organic molecule
Emp. Form.C31H25N3O4
Mol. Mass.503.5479
SMILESCOc1cccc(c1)N1C(=O)\C(=C\c2ccc(OCC(=O)Nc3ccccc3)cc2)N=C1c1ccccc1