Reaction Details
TargetMitogen-activated protein kinase 1
LigandBDBM50089079
Substrate/Competitorn/a
Meas. Tech.ChEMBL_1497090 (CHEMBL3580223)
IC50 43±n/a nM
Citation Awadallah, FMAbou-Seri, SMAbdulla, MMGeorgey, HH Design and synthesis of potent 1,2,4-trisubstituted imidazolinone derivatives with dual p38aMAPK and ERK1/2 inhibitory activity. Eur J Med Chem94:397-404 (2015) 
 
Mitogen-activated protein kinase 1
Name:Mitogen-activated protein kinase 1
Type:Ser/Thr Protein Kinase
Mol. Mass.:41392.76
Organism:Homo sapiens (Human)
Description:P28482
Residue:360
BDBM50089079
NameBDBM50089079
Synonyms:CHEMBL3577639
TypeSmall organic molecule
Emp. Form.C32H27N3O4
Mol. Mass.517.5745
SMILESCOc1ccc(cc1)N1C(=O)\C(=C\c2ccc(OCC(=O)Nc3ccc(C)cc3)cc2)N=C1c1ccccc1