Reaction Details
TargetMitogen-activated protein kinase 3
LigandBDBM50089082
Substrate/Competitorn/a
Meas. Tech.ChEMBL_1497089 (CHEMBL3580222)
IC50 23±n/a nM
Citation Awadallah, FMAbou-Seri, SMAbdulla, MMGeorgey, HH Design and synthesis of potent 1,2,4-trisubstituted imidazolinone derivatives with dual p38aMAPK and ERK1/2 inhibitory activity. Eur J Med Chem94:397-404 (2015) 
 
Mitogen-activated protein kinase 3
Name:Mitogen-activated protein kinase 3
Type:Protein
Mol. Mass.:43136.58
Organism:Homo sapiens (Human)
Description:curated by PDB 4QTB
Residue:379
BDBM50089082
NameBDBM50089082
Synonyms:CHEMBL3577636
TypeSmall organic molecule
Emp. Form.C31H25N3O4
Mol. Mass.503.5479
SMILESCOc1ccc(cc1)N1C(=O)\C(=C\c2ccc(OCC(=O)Nc3ccccc3)cc2)N=C1c1ccccc1