Reaction Details
TargetHistone deacetylase 1
LigandBDBM50089093
Substrate/Competitorn/a
Meas. Tech.ChEMBL_1495533 (CHEMBL3580079)
IC50 190±n/a nM
Citation He, SDong, GWang, ZChen, WHuang, YLi, ZJiang, YLiu, NYao, JMiao, ZZhang, WSheng, C Discovery of Novel Multiacting Topoisomerase I/II and Histone Deacetylase Inhibitors. ACS Med Chem Lett6:239-43 (2015) 
 
Histone deacetylase 1
Name:Histone deacetylase 1
Type:Enzyme
Mol. Mass.:55090.27
Organism:Homo sapiens (Human)
Description:Q13547
Residue:482
BDBM50089093
NameBDBM50089093
Synonyms:CHEMBL3577693
TypeSmall organic molecule
Emp. Form.C33H33N7O5
Mol. Mass.607.659
SMILESCN1C2N(CCc3c2[nH]c2ccc(O)cc32)C(=O)c2cc(NCc3ccc(cc3)-c3noc(CCCCC(=O)NO)n3)ccc12