Reaction Details
TargetHistone deacetylase 1
LigandBDBM50089101
Substrate/Competitorn/a
Meas. Tech.ChEMBL_1495533 (CHEMBL3580079)
IC50 30±n/a nM
Citation He, SDong, GWang, ZChen, WHuang, YLi, ZJiang, YLiu, NYao, JMiao, ZZhang, WSheng, C Discovery of Novel Multiacting Topoisomerase I/II and Histone Deacetylase Inhibitors. ACS Med Chem Lett6:239-43 (2015) 
 
Histone deacetylase 1
Name:Histone deacetylase 1
Type:Enzyme
Mol. Mass.:55090.27
Organism:Homo sapiens (Human)
Description:Q13547
Residue:482
BDBM50089101
NameBDBM50089101
Synonyms:CHEMBL3577691
TypeSmall organic molecule
Emp. Form.C34H38N6O5
Mol. Mass.610.7027
SMILESCN1C2N(CCc3c2[nH]c2ccc(O)cc32)C(=O)c2cc(NCc3ccc(NC(=O)CCCCCCC(=O)NO)cc3)ccc12