Reaction Details
TargetHexokinase-4
LigandBDBM50089134
Substrate/Competitorn/a
Meas. Tech.ChEMBL_1495696 (CHEMBL3578684)
EC50 6.0±n/a nM
Citation Park, KLee, BMHyun, KHHan, TLee, DHChoi, HH Design and Synthesis of Acetylenyl Benzamide Derivatives as Novel Glucokinase Activators for the Treatment of T2DM. ACS Med Chem Lett6:296-301 (2015) 
 
Hexokinase-4
Name:Hexokinase-4
Type:Enzyme
Mol. Mass.:52175.81
Organism:Homo sapiens (Human)
Description:P35557
Residue:465
BDBM50089134
NameBDBM50089134
Synonyms:CHEMBL3577728
TypeSmall organic molecule
Emp. Form.C29H35N5O3
Mol. Mass.501.6199
SMILESCOC[C@H](C)Oc1cc(cc(c1)C(=O)Nc1ccn(C)n1)C#Cc1cccc(NCCN2CCCC2)c1