Reaction Details
TargetHexokinase-4
LigandBDBM50089143
Substrate/Competitorn/a
Meas. Tech.ChEMBL_1495696 (CHEMBL3578684)
EC50 21±n/a nM
Citation Park, KLee, BMHyun, KHHan, TLee, DHChoi, HH Design and Synthesis of Acetylenyl Benzamide Derivatives as Novel Glucokinase Activators for the Treatment of T2DM. ACS Med Chem Lett6:296-301 (2015) 
 
Hexokinase-4
Name:Hexokinase-4
Type:Enzyme
Mol. Mass.:52175.81
Organism:Homo sapiens (Human)
Description:P35557
Residue:465
BDBM50089143
NameBDBM50089143
Synonyms:CHEMBL3577719
TypeSmall organic molecule
Emp. Form.C24H25N3O4
Mol. Mass.419.473
SMILESCOC[C@H](C)Oc1cc(cc(c1)C(=O)Nc1ccn(C)n1)C#Cc1ccccc1OC