Reaction Details
TargetProtein arginine N-methyltransferase 7
LigandBDBM50089221
Substrate/Competitorn/a
Meas. Tech.ChEMBL_1496151 (CHEMBL3578932)
IC50>50000±n/a nM
Citation Smil, DEram, MSLi, FKennedy, SSzewczyk, MMBrown, PJBarsyte-Lovejoy, DArrowsmith, CHVedadi, MSchapira, M Discovery of a Dual PRMT5-PRMT7 Inhibitor. ACS Med Chem Lett6:408-12 (2015) 
 
Protein arginine N-methyltransferase 7
Name:Protein arginine N-methyltransferase 7
Type:Enzyme
Mol. Mass.:78440.77
Organism:Homo sapiens (Human)
Description:Q9NVM4
Residue:692
BDBM50089221
NameBDBM50089221
Synonyms:CHEMBL3577854
TypeSmall organic molecule
Emp. Form.C15H23N7O4S
Mol. Mass.397.453
SMILESCCNC(=O)NCCSC[C@H]1O[C@H]([C@H](O)[C@@H]1O)n1cnc2c(N)ncnc12