Reaction Details
TargetMitogen-activated protein kinase 9
LigandBDBM50089225
Substrate/Competitorn/a
Meas. Tech.ChEMBL_1496171 (CHEMBL3578952)
IC50 12±n/a nM
Citation Zheng, KPark, CMIqbal, SHernandez, PPark, HLoGrasso, PVFeng, Y Pyridopyrimidinone Derivatives as Potent and Selective c-Jun N-Terminal Kinase (JNK) Inhibitors. ACS Med Chem Lett6:413-8 (2015) 
 
Mitogen-activated protein kinase 9
Name:Mitogen-activated protein kinase 9
Type:Enzyme
Mol. Mass.:48131.49
Organism:Homo sapiens (Human)
Description:JNK-2 was purchased from Upstate Cell Signaling Solutions (formerly Upstate Biotechnology).
Residue:424
BDBM50089225
NameBDBM50089225
Synonyms:CHEMBL3577877
TypeSmall organic molecule
Emp. Form.C22H32N6O2
Mol. Mass.412.5285
SMILESCC(C)NC(=O)N[C@H]1CC[C@@H](CC1)Nc1ncc2ccc(=O)n(C3CCCC3)c2n1