Reaction Details
TargetMitogen-activated protein kinase 9
LigandBDBM50089223
Substrate/Competitorn/a
Meas. Tech.ChEMBL_1496171 (CHEMBL3578952)
IC50 18±n/a nM
Citation Zheng, KPark, CMIqbal, SHernandez, PPark, HLoGrasso, PVFeng, Y Pyridopyrimidinone Derivatives as Potent and Selective c-Jun N-Terminal Kinase (JNK) Inhibitors. ACS Med Chem Lett6:413-8 (2015) 
 
Mitogen-activated protein kinase 9
Name:Mitogen-activated protein kinase 9
Type:Enzyme
Mol. Mass.:48131.49
Organism:Homo sapiens (Human)
Description:JNK-2 was purchased from Upstate Cell Signaling Solutions (formerly Upstate Biotechnology).
Residue:424
BDBM50089223
NameBDBM50089223
Synonyms:CHEMBL3577855
TypeSmall organic molecule
Emp. Form.C16H22N4O2
Mol. Mass.302.3715
SMILESCC(C)n1c2nc(N[C@H]3CC[C@H](O)CC3)ncc2ccc1=O