Reaction Details
TargetPotassium voltage-gated channel subfamily H member 2
LigandBDBM50089252
Substrate/Competitorn/a
Meas. Tech.ChEMBL_1496195 (CHEMBL3579079)
Ki>9182±n/a nM
Citation Andrews, MDAf Forselles, KBeaumont, KGalan, SRGlossop, PAGrenie, MJessiman, AKenyon, ASLunn, GMaw, GOwen, RMPryde, DCRoberts, DTran, TD Discovery of a Selective TRPM8 Antagonist with Clinical Efficacy in Cold-Related Pain. ACS Med Chem Lett6:419-24 (2015) 
 
Potassium voltage-gated channel subfamily H member 2
Name:Potassium voltage-gated channel subfamily H member 2
Type:Multi-pass membrane protein
Mol. Mass.:126672.65
Organism:Homo sapiens (Human)
Description:Q12809
Residue:1159
BDBM50089252
NameBDBM50089252
Synonyms:CHEMBL3577889
TypeSmall organic molecule
Emp. Form.C26H21FN2O3
Mol. Mass.428.4549
SMILESC[C@@H](N(Cc1cccc(c1)C(O)=O)C(=O)c1cc2ccccc2cn1)c1ccc(F)cc1