Reaction Details
TargetPhosphatidylinositol 4,5-bisphosphate 3-kinase catalytic subunit alpha isoform
LigandBDBM50089304
Substrate/Competitorn/a
Meas. Tech.ChEMBL_1496312 (CHEMBL3579761)
IC50 0.300000±n/a nM
Citation Han, FLin, SLiu, PLiu, XTao, JDeng, XYi, CXu, H Discovery of a Novel Series of Thienopyrimidine as Highly Potent and Selective PI3K Inhibitors. ACS Med Chem Lett6:434-8 (2015) 
 
Phosphatidylinositol 4,5-bisphosphate 3-kinase catalytic subunit alpha isoform
Name:Phosphatidylinositol 4,5-bisphosphate 3-kinase catalytic subunit alpha isoform
Type:Enzyme Subunit
Mol. Mass.:124294.87
Organism:Homo sapiens (Human)
Description:P42336
Residue:1068
BDBM50089304
NameBDBM50089304
Synonyms:CHEMBL3577926
TypeSmall organic molecule
Emp. Form.C22H13ClFN5O2S2
Mol. Mass.497.952
SMILESFc1ccc(cc1)S(=O)(=O)Nc1cc(cnc1Cl)-c1cc2c(ncnc2s1)-c1ccncc1